CodeAccessAndUseConditionType
type: ConceptScheme
alternative label: Code access and use condition type
definition: Types of restrictions on the access and use of a service.
has top concept: LEGAL_CONSTRAINT
has top concept: SECURITY_CONSTRAINT
has top concept: SERVICE_CONSUMPTION_CONSTRAINT
has top concept: SERVICE_POLICY

LEGAL_CONSTRAINT
type: Concept
alternative label: Legal Constraint
definition: Restrictions and legal prerequisites for accessing and using the service.
in scheme: CodeAccessAndUseConditionType

SECURITY_CONSTRAINT
type: Concept
alternative label: Security Constraint
definition: Handling restrictions imposed on the service for national security or similar security concerns.
in scheme: CodeAccessAndUseConditionType

SERVICE_CONSUMPTION_CONSTRAINT
type: Concept
alternative label: Service Consumption Constraint
definition: Restrictions on the consumption of the service.
in scheme: CodeAccessAndUseConditionType

SERVICE_POLICY
type: Concept
alternative label: Service Policy
definition: A policy governing the access and uses of one or more services.
in scheme: CodeAccessAndUseConditionType

CodeApplicationMessageExchangePatternType
type: ConceptScheme
alternative label: Application Message Exchange Pattern Type Code
definition: A categorisation of services based on the type of application message exchange pattern (MEP).
has top concept: ASYNCHRONOUS_REQUEST_REPLY
has top concept: BROKERED_PUBLISH_SUBSCRIBE_WITH_PUSH_MECHANISM
has top concept: FAN_OUT
has top concept: ONE_WAY
has top concept: PUBLISH_SUBSCRIBE
has top concept: PUBLISH_SUBSCRIBE_WITH_PULL_MECHANISM
has top concept: PUBLISH_SUBSCRIBE_WITH_PUSH_MECHANISM
has top concept: REQUEST_REPLY
has top concept: SYNCHRONOUS_REQUEST_REPLY

ASYNCHRONOUS_REQUEST_REPLY
type: Concept
alternative label: Asynchronous Request Reply
definition: A Request/Reply application MEP that does not restrict the consumer from completing other operations while waiting for the information service to respond.
in scheme: CodeApplicationMessageExchangePatternType

BROKERED_PUBLISH_SUBSCRIBE_WITH_PUSH_MECHANISM
type: Concept
alternative label: Brokered Publish Subscribe with Push Mechanism
definition: A Publish/Subscribe pattern with push mechanism introducing a layer of decoupling between the publisher and subscribers by means of a broker.
in scheme: CodeApplicationMessageExchangePatternType

FAN_OUT
type: Concept
alternative label: Fan Out
definition: An application MEP consisting of a consumer sending sequentially a message to multiple information service according to the One-Way application MEP.
in scheme: CodeApplicationMessageExchangePatternType

ONE_WAY
type: Concept
alternative label: One Way
definition: An application MEP consisting of a consumer sending a message to an information service without any requisite response from the information service.
in scheme: CodeApplicationMessageExchangePatternType

PUBLISH_SUBSCRIBE
type: Concept
alternative label: Publish Subscribe
definition: An application MEP consisting of a consumer sending a message to an information service without any requisite response from the information service.
in scheme: CodeApplicationMessageExchangePatternType

PUBLISH_SUBSCRIBE_WITH_PULL_MECHANISM
type: Concept
alternative label: Publish Subscribe with Pull Mechanism
definition: A Publish/Subscribe pattern whereby the information service keeps necessary updates available to the consumer, in accordance with the subscription.
in scheme: CodeApplicationMessageExchangePatternType

PUBLISH_SUBSCRIBE_WITH_PUSH_MECHANISM
type: Concept
alternative label: Publish Subscribe with Push Mechanism
definition: A Publish/Subscribe pattern whereby the information service sends necessary updates (publish) to the consumer, in accordance with the subscription.
in scheme: CodeApplicationMessageExchangePatternType

REQUEST_REPLY
type: Concept
alternative label: Request Reply
definition: An application MEP consisting of a consumer sending a request to an information service, the service then executing the request and providing a reply to the consumer.
in scheme: CodeApplicationMessageExchangePatternType

SYNCHRONOUS_REQUEST_REPLY
type: Concept
alternative label: Synchronous Request Reply
definition: A Request/Reply application MEP requiring that the consumer wait for the information service to provide a response, and is unable to send/receive any other requests/responses until the initial response is received.
in scheme: CodeApplicationMessageExchangePatternType

CodeBusinessActivityType
type: ConceptScheme
alternative label: Business Activity Type Code
definition: A categorisation of services based on the type of business activity.
has top concept: AERODROME_OPERATION
has top concept: AIRSPACE_ORGANISATION_AND_MANAGEMENT
has top concept: AIRSPACE_USER_OPERATIONS
has top concept: COMMUNICATION_NAVIGATION_SURVEILLANCE
has top concept: CONFLICT_MANAGEMENT
has top concept: DEMAND_AND_CAPACITY_BALANCING
has top concept: INFORMATION_MANAGEMENT
has top concept: SERVICE_DELIVERY_MANAGEMENT
has top concept: TRAFFIC_SYNCHRONISATION

AERODROME_OPERATION
type: Concept
alternative label: Aerodrome Operation
definition: Aerodrome operations describe the aerodrome functionality within the ATM system in terms of such factors as information acquisition and delivery, facility access, demand on airspace, and limits on usability.
in scheme: CodeBusinessActivityType

AIRSPACE_ORGANISATION_AND_MANAGEMENT
type: Concept
alternative label: Airspace Organisation and Management
definition: Design and management of airspace structures (e.g. P/D/R,TSA/CBA, En Route/TMA Sectors, Free Route Airspace, etc.), and routes (SID/STAR RNAV/RNP routes).
in scheme: CodeBusinessActivityType

AIRSPACE_USER_OPERATIONS
type: Concept
alternative label: Airspace User Operations
definition: Airspace user operations refer to the ATM-related aspects of flight operations.
in scheme: CodeBusinessActivityType

COMMUNICATION_NAVIGATION_SURVEILLANCE
type: Concept
alternative label: Communication Navigation Surveillance
definition: Communication, Navigation, Surveillance.
in scheme: CodeBusinessActivityType

CONFLICT_MANAGEMENT
type: Concept
alternative label: Conflict Management
definition: Conflict management includes strategic de-confliction, separation provision and collision avoidance of traffic. It also includes the mitigation of hazards due to adverse weather conditions and foreign objects.
in scheme: CodeBusinessActivityType

DEMAND_AND_CAPACITY_BALANCING
type: Concept
alternative label: Demand and Capacity Balancing
definition: Assessment and balancing of demand and capacity at network and airport level to provide the NOP/AOP for the day of operation.
in scheme: CodeBusinessActivityType

INFORMATION_MANAGEMENT
type: Concept
alternative label: Information Management
definition: The provision of the right information to stakeholders at the time that it is needed.
in scheme: CodeBusinessActivityType

SERVICE_DELIVERY_MANAGEMENT
type: Concept
alternative label: Service Delivery Management
definition: Management of the overall service delivery of ATM by balancing and consolidating the provision of the services from the other areas of AOM (Airspace Organisation and Management), AUO (Airspace User Operations), DCB (Demand Capacity Balancing), TS (Traffic Synchronisation), CM (Conflict Management), and AO (Aerodrome Operations).
in scheme: CodeBusinessActivityType

TRAFFIC_SYNCHRONISATION
type: Concept
alternative label: Traffic Synchronisation
definition: Synchronisation of arrivals and departures with surface operations.
in scheme: CodeBusinessActivityType

CodeDocumentType
type: ConceptScheme
alternative label: Code document type
definition: Types of documents.
has top concept: CODE_EXAMPLE
has top concept: INFORMATION_DEFINITION
has top concept: MACHINE_READABLE_SERVICE_DESCRIPTION
has top concept: MESSAGE_EXAMPLE
has top concept: OTHER
has top concept: POLICY_DOCUMENT
has top concept: PROTOCOL_SPECIFICATION
has top concept: QUALITY_OF_SERVICE_DOCUMENT
has top concept: SEMANTIC_CORRESPONDENCE_REPORT
has top concept: SERVICE_BEHAVIOUR_DESCRIPTION
has top concept: SERVICE_CERTIFICATION
has top concept: SERVICE_MODEL
has top concept: SERVICE_SPECIFICATION
has top concept: SERVICE_STANDARD
has top concept: SERVICE_VALIDATION_REPORT

CODE_EXAMPLE
type: Concept
alternative label: Code Example
definition: Examples of code exemplifying the implementation of the consuming service interface.
in scheme: CodeDocumentType

INFORMATION_DEFINITION
type: Concept
alternative label: Information Definition
definition: A formal description of exchanged information.
in scheme: CodeDocumentType

MACHINE_READABLE_SERVICE_DESCRIPTION
type: Concept
alternative label: Machine Readable Service Description
definition: A service interface definition in a machine-readable format using a standard service definition formalism/language.
in scheme: CodeDocumentType

MESSAGE_EXAMPLE
type: Concept
alternative label: Message Example
definition: An example of the messages used by the service.
in scheme: CodeDocumentType

OTHER
type: Concept
alternative label: Other
definition: A document of a type not covered by a value in this list.
in scheme: CodeDocumentType

POLICY_DOCUMENT
type: Concept
alternative label: Policy Document
definition: A policy governing e.g. the access and uses of one or more services.
in scheme: CodeDocumentType

PROTOCOL_SPECIFICATION
type: Concept
alternative label: Protocol Specification
definition: A specification of the service interface protocols.
in scheme: CodeDocumentType

QUALITY_OF_SERVICE_DOCUMENT
type: Concept
alternative label: Quality Of Service Document
definition: A document containing statements on the quality of service.
in scheme: CodeDocumentType

SEMANTIC_CORRESPONDENCE_REPORT
type: Concept
alternative label: Semantic Correspondence Report
definition: A report containing the semantic correspondences between an information definition and the ATM Information Reference Model.
in scheme: CodeDocumentType

SERVICE_BEHAVIOUR_DESCRIPTION
type: Concept
alternative label: Service Behaviour Description
definition: A description of the service behaviour.
in scheme: CodeDocumentType

SERVICE_CERTIFICATION
type: Concept
alternative label: Service Certification
definition: A service certification.
in scheme: CodeDocumentType

SERVICE_MODEL
type: Concept
alternative label: Service Model
definition: A model view, expressed using a formal and standardised notation, that formalises the representation of the business logic of its service interfaces, service operations, service behaviour and exchanged information.
in scheme: CodeDocumentType

SERVICE_SPECIFICATION
type: Concept
alternative label: Service Specification
definition: A specification used in the implementation of the service.
in scheme: CodeDocumentType

SERVICE_STANDARD
type: Concept
alternative label: Service Standard
definition: A document, issued by a community of interest, used to harmonize service implementations.
in scheme: CodeDocumentType

SERVICE_VALIDATION_REPORT
type: Concept
alternative label: Service Validation Report
definition: A report on the result of the activities whereby a service is checked for conformance with the service objectives and requirements.
in scheme: CodeDocumentType

CodeICAOPublicationType
type: ConceptScheme
alternative label: Code ICAO publication type
definition: A categorisation of services based on the type of ICAO publication from which the operational need for the service can be derived.
has top concept: ANNEX
has top concept: GUIDANCE
has top concept: PANS

ANNEX
type: Concept
alternative label: Annex
definition: The operational need for the service is derived from an ICAO Annex.
in scheme: CodeICAOPublicationType

GUIDANCE
type: Concept
alternative label: Guidance
definition: The operational need for the service is derived from an ICAO guidance document.
in scheme: CodeICAOPublicationType

PANS
type: Concept
definition: The operational need for the service is derived from an ICAO PANS.
in scheme: CodeICAOPublicationType

CodeICAORegionType
type: ConceptScheme
source: The list of ICAO Regions as defined in Appendix 1 to the Directives to Regional Air Navigation Meetings and Rules of Procedure for their Conduct (ICAO Doc 8144-AN/874).
alternative label: ICAO Location Indicator
alternative label: ICAO Region Type Code
definition: A specified geographical area, defined as an ICAO air navigation region.
has top concept: AFI
has top concept: ASIA
has top concept: CAR
has top concept: EUR
has top concept: MID
has top concept: NAM
has top concept: NAT
has top concept: PAC
has top concept: SAM

AFI
type: Concept
alternative label: Africa-Indian Ocean Region
definition: The area embracing Africa and associated oceanic areas and land masses between 25 degrees West and 75 degrees East and South to the South Pole.
in scheme: CodeICAORegionType

ASIA
type: Concept
alternative label: Asia Region
definition: The area south of the Asian part of the USSR territory, and embracing Pakistan, Japan and New Zealand, and associated oceanic areas and land masses eastward from 75 degrees E to 175 degrees W, to the South Pole.
in scheme: CodeICAORegionType

CAR
type: Concept
alternative label: Caribbean Region
definition: The area embracing Mexico, Central America, the Bahamas and the West Indies.
in scheme: CodeICAORegionType

EUR
type: Concept
alternative label: European Region
definition: The area embracing Europe and the Asian part of the USSR territory, north to the North Pole, and including Turkey.
in scheme: CodeICAORegionType

MID
type: Concept
alternative label: Middle East Region
definition: The area embracing that part of Asia west of Pakistan, but excluding Turkey and USSR territory.
in scheme: CodeICAORegionType

NAM
type: Concept
alternative label: North American Region
definition: The area embracing the United States and Canada and north to the North Pole.
in scheme: CodeICAORegionType

NAT
type: Concept
alternative label: North Atlantic Region
definition: The North Atlantic area not covered by the NAM, CAR, SAM, EUR and AFI Regions, and north to the North Pole.
in scheme: CodeICAORegionType

PAC
type: Concept
alternative label: Pacific Region
definition: The Pacific area not covered by the NAM, CAR, SAM and ASIA Regions, and south to the South Pole.
in scheme: CodeICAORegionType

SAM
type: Concept
alternative label: South American Region
definition: The area embracing South America and the associated oceanic areas and land masses between 25 degrees W and 90 degrees W and south to the South Pole.
in scheme: CodeICAORegionType

CodeInformationDomainType
type: ConceptScheme
alternative label: Information Domain Type Code
definition: A categorisation of services based on information domains.
has top concept: AERONAUTICAL_INFORMATION
has top concept: CAPACITY_DEMAND_AND_FLOW_INFORMATION
has top concept: ENVIRONMENT_INFORMATION
has top concept: FLIGHT_INFORMATION
has top concept: METEOROLOGICAL_INFORMATION
has top concept: OTHER_INFORMATION
has top concept: SURVEILLANCE_INFORMATION

AERONAUTICAL_INFORMATION
type: Concept
alternative label: Aeronautical information
definition: Information resulting from the assembly, analysis and formatting of aeronautical data.
in scheme: CodeInformationDomainType
related: AERONAUTICAL_INFORMATION_EXCHANGE

CAPACITY_DEMAND_AND_FLOW_INFORMATION
type: Concept
alternative label: Capacity, demand and flow information
definition: Information about the strategic evaluation of the system-wide traffic flows and aerodrome capacities to allow airspace users to determine when, where and how they operate, while mitigating conflicting needs for airspace and aerodrome capacity.
in scheme: CodeInformationDomainType

ENVIRONMENT_INFORMATION
type: Concept
alternative label: Environment information
definition: Information about the environmental impact of air traffic and the measures taken to minimise the impact.
in scheme: CodeInformationDomainType

FLIGHT_INFORMATION
type: Concept
alternative label: Flight information
definition: Information useful for the safe and efficient conduct of flight, including information on air traffic, meteorological conditions, aerodrome conditions or air route facilities.
in scheme: CodeInformationDomainType
related: FLIGHT INFORMATION EXCHANGE

METEOROLOGICAL_INFORMATION
type: Concept
alternative label: Meteorological information
definition: Meteorological report, analysis, forecast, and any other statement relating to existing or expected meteorological conditions.
in scheme: CodeInformationDomainType
related: METEOROLOGICAL_INFORMATION_EXCHANGE

OTHER_INFORMATION
type: Concept
alternative label: Other information
definition: Information not covered by any other listed information domain.
in scheme: CodeInformationDomainType

SURVEILLANCE_INFORMATION
type: Concept
alternative label: Surveillance information
broad match: surveillance
definition: Information about a flight's position, vector, identity and flight path intent as reported by ground or on-board sensors.
in scheme: CodeInformationDomainType

CodeInformationExchangeModelType
type: ConceptScheme
alternative label: Code information exchange model type
definition: A list of information exchange models created by communities of interest.
has top concept: AIXM_5_1
has top concept: AIXM_5_1_1
has top concept: AMXM_2_0
has top concept: FIXM 4 2
has top concept: IWXXM_3_ 0

AIXM_5_1
type: Concept
alternative label: AIXM 5.1
definition: Aeronautical Information Exchange Model (AIXM) 5.1
in scheme: CodeInformationExchangeModelType

AIXM_5_1_1
type: Concept
alternative label: AIXM 5.1.1
definition: Aeronautical Information Exchange Model (AIXM) 5.1.1
in scheme: CodeInformationExchangeModelType

AMXM_2_0
type: Concept
alternative label: AMXM 2.0
definition: Aerodrome Mapping Exchange Model (AMXM) 2.0
in scheme: CodeInformationExchangeModelType

FIXM 4 2
type: Concept
alternative label: FIXM 4.2
definition: Flight Information Exchange Model (FIXM) 4.2
in scheme: CodeInformationExchangeModelType

IWXXM_3_ 0
type: Concept
alternative label: IWXXM 3.0
definition: ICAO Meteorological Information Exchange Model (IWXXM) 3.0
in scheme: CodeInformationExchangeModelType

CodeInformationSecurityCategoryType
type: ConceptScheme
alternative label: Code Information Security Category Type
definition: Categorisation of information and information systems based on the information security impact on safety risk analysis. Information service providers and consumers apply the performance-based information security requirements based on the category.
has top concept: ADVANCED
has top concept: BASIC
has top concept: INTERMEDIATE
has top concept: NONE

ADVANCED
type: Concept
alternative label: Advanced
definition: Information security categories shall be reviewed monthly based on the latest risk analysis.
in scheme: CodeInformationSecurityCategoryType

BASIC
type: Concept
alternative label: Basic
definition: Information security categories shall be reviewed every (2) years based on the latest risk analysis.
in scheme: CodeInformationSecurityCategoryType

INTERMEDIATE
type: Concept
alternative label: Intermediate
definition: Information security categories shall be reviewed annually based on the latest risk analysis.
in scheme: CodeInformationSecurityCategoryType

NONE
type: Concept
alternative label: None
definition: None.
in scheme: CodeInformationSecurityCategoryType

CodeLifeCycleStageType
type: ConceptScheme
alternative label: Life Cycle Stage Type Code
definition: A categorisation of services based on the current, past, or future availability for provisioning.
has top concept: OPERATIONAL
has top concept: PROSPECTIVE
has top concept: RETIRED

OPERATIONAL
type: Concept
alternative label: Operational
definition: The status indicating that the service is employed in its operational environment.
in scheme: CodeLifeCycleStageType

PROSPECTIVE
type: Concept
alternative label: Prospective
definition: The status indicating that the service is being designed, developed, or tested for operational activities and is expected to be available in the future.
in scheme: CodeLifeCycleStageType

RETIRED
type: Concept
alternative label: Retired
definition: The status indicating that active support for the service has been withdrawn, the service has been partially or totally replaced by a new service, or an upgraded service has been installed.
in scheme: CodeLifeCycleStageType

CodePrimitiveMessageExchangePatternType
type: ConceptScheme
alternative label: Code primitive message exchange pattern type
definition: Message exchange patterns that are directly related to the capability of the lower level protocols.
has top concept: FIRE AND FORGET
has top concept: SYNCHRONOUS_REQUEST_RESPONSE

FIRE AND FORGET
type: Concept
alternative label: Fire and Forget
definition: A primitive message exchange pattern consisting of a message being sent from one infrastructure service to another.
in scheme: CodePrimitiveMessageExchangePatternType

SYNCHRONOUS_REQUEST_RESPONSE
type: Concept
alternative label: Synchronous Request Response
definition: A primitive MEP consisting of 1) a message (request) being sent from a consumer infrastructure service to a provider infrastructure service, 2) the consumer infrastructure service remaining blocked awaiting for a response and the provider infrastructure service remaining blocked processing the response and 3) a message (response) being sent from the provider infrastructure service to the consumer infrastructure service.
in scheme: CodePrimitiveMessageExchangePatternType

CodeQualityOfServiceMeasureType
type: ConceptScheme
alternative label: Code quality of service measure type
definition: A categorisation of services based on the quality characteristics to be taken into account when evaluating the properties of a service. The scheme can be augmented based on ISO/IEC 25010 (https://iso25000.com/index.php/en/iso-25000-standards/iso-25010).
has top concept: ACCOUNTABILITY
has top concept: AUTHENTICITY
has top concept: AVAILABILITY
has top concept: CAPACITY
has top concept: CONFIDENTIALITY
has top concept: INTEGRITY
has top concept: RECOVERABILITY
has top concept: TIME_BEHAVIOUR

ACCOUNTABILITY
type: Concept
alternative label: Accountability
definition: The degree to which the actions of an entity can be traced uniquely to the entity.
in scheme: CodeQualityOfServiceMeasureType

AUTHENTICITY
type: Concept
alternative label: Authenticity
definition: The degree to which the identity of a subject or resource can be proved to be the one claimed.
in scheme: CodeQualityOfServiceMeasureType

AVAILABILITY
type: Concept
alternative label: Availability
definition: The degree to which a service is operational and accessible when required for use.
in scheme: CodeQualityOfServiceMeasureType

CAPACITY
type: Concept
alternative label: Capacity
definition: The maximum rate at which a service can process transactions and the maximum message size of responses. Note: Measurements can include the number of items that can be stored, the number of concurrent users, the communication bandwidth, throughput of transactions, and size of messages.
in scheme: CodeQualityOfServiceMeasureType

CONFIDENTIALITY
type: Concept
alternative label: Confidentiality
definition: The degree to which a service ensures that data are accessible only to those authorized to have access.
in scheme: CodeQualityOfServiceMeasureType

INTEGRITY
type: Concept
alternative label: Integrity
definition: An expression of the assurance that a system, product or component prevents unauthorized access to, or modification of, an information service interface or information.
in scheme: CodeQualityOfServiceMeasureType

RECOVERABILITY
type: Concept
alternative label: Recoverability
definition: The degree to which, in the event of an interruption or a failure, the desired state of the service can be re-established.
in scheme: CodeQualityOfServiceMeasureType

TIME_BEHAVIOUR
type: Concept
alternative label: Time Behaviour
definition: A measurement of the processing times of a service. Note: This parameter may be expressed as an indication of a maximum time needed for the service provider to complete the request, measured from the time instant the service provider receives the request to the time instant the service provider sends the response or makes it available.
in scheme: CodeQualityOfServiceMeasureType

CodeRegulatedInformationExchangeType
type: ConceptScheme
alternative label: Regulated Information Exchange Type Code
definition: A categorisation of services based on the information exchanges that are regulated in European Union law, i.e., Commission Implementing Regulation (EU) 2021/116, Common Project One that replaces Commission Implementing Regulation (EU) No 716/2014, Pilot Common Project.
has top concept: AERONAUTICAL_INFORMATION_EXCHANGE
has top concept: COOPERATIVE_NETWORK_INFORMATION_EXCHANGE
has top concept: FLIGHT_INFORMATION_EXCHANGE
has top concept: METEOROLOGICAL_INFORMATION_EXCHANGE
has top concept: SWIM_INFRASTRUCTURE_EXCHANGE

AERONAUTICAL_INFORMATION_EXCHANGE
type: Concept
alternative label: Aeronautical Information Exchange
broad match: aeronautical
definition: The Aeronautical information exchange regulated in Commission Implementing Regulation (EU) 2021/116, Common Project One.
in scheme: CodeRegulatedInformationExchangeType

COOPERATIVE_NETWORK_INFORMATION_EXCHANGE
type: Concept
alternative label: Cooperative Network Information Exchange
definition: The Cooperative network information exchange regulated in Commission Implementing Regulation (EU) 2021/116, Common Project One.
in scheme: CodeRegulatedInformationExchangeType

FLIGHT_INFORMATION_EXCHANGE
type: Concept
alternative label: Flight Information Exchange
broad match: flight
definition: The Flight information exchange regulated in Commission Implementing Regulation (EU) 2021/116, Common Project One.
in scheme: CodeRegulatedInformationExchangeType

METEOROLOGICAL_INFORMATION_EXCHANGE
type: Concept
alternative label: Meteorological Information Exchange
broad match: weather
definition: The Meteorological information exchange regulated in Commission Implementing Regulation (EU) 2021/116, Common Project One.
in scheme: CodeRegulatedInformationExchangeType

SWIM_INFRASTRUCTURE_EXCHANGE
type: Concept
alternative label: SWIM Infrastructure Exchange
definition: The Common infrastructure components regulated in Commission Implementing Regulation (EU) No 716/2014, Pilot Common Project.
in scheme: CodeRegulatedInformationExchangeType

CodeSWIMServiceArtefactType
type: ConceptScheme
alternative label: SWIM Service Artefact Type Code
definition: A categorisation of service artefacts.
has top concept: SERVICE_DEFINITION
has top concept: SERVICE_DESCRIPTION
has top concept: SERVICE_OVERVIEW

SERVICE_DEFINITION
type: Concept
alternative label: Service Definition
definition: A document, issued by a community of interest, used to harmonize service implementations.
in scheme: CodeSWIMServiceArtefactType

SERVICE_DESCRIPTION
type: Concept
alternative label: Service Description
definition: Information needed in order to use, or consider using, a service.
in scheme: CodeSWIMServiceArtefactType

SERVICE_OVERVIEW
type: Concept
alternative label: Service Overview
definition: A set of information service metadata intended to promote service discovery and an initial evaluation of the information service characteristics.
in scheme: CodeSWIMServiceArtefactType

CodeSecurityMechanismType
type: ConceptScheme
alternative label: Code security mechanism type
definition: A list of security mechanism based on the SWIM Technical Infrastructure capability enabling secured information exchange.
has top concept: AUTHENTICATION
has top concept: AUTHORISATION
has top concept: CONFIDENTIALITY
has top concept: INTEGRITY

AUTHENTICATION
type: Concept
alternative label: Authentication
definition: A security mechanism ensuring that the identity of a subject can be proved to be the one claimed.
in scheme: CodeSecurityMechanismType

AUTHORISATION
type: Concept
alternative label: Authorisation
definition: A security mechanism for the granting of rights and, based on these rights, the granting of access.
in scheme: CodeSecurityMechanismType

CONFIDENTIALITY
type: Concept
alternative label: Confidentiality
definition: A security mechanism protecting information from disclosure to unauthorized parties.
in scheme: CodeSecurityMechanismType

INTEGRITY
type: Concept
alternative label: Integrity
definition: A security mechanism protecting information from modification by unauthorized parties.
in scheme: CodeSecurityMechanismType

CodeServiceType
type: ConceptScheme
alternative label: Code service type
definition: A categorisation of services based on the nature of the service.
has top concept: AERONAUTICAL_AERODROME_MAP_ACCESS_SERVICE
has top concept: AERONAUTICAL_DATA_PRODUCT_ACCESS_SERVICE
has top concept: AERONAUTICAL_FEATURE_ACCESS_AND_MANAGEMENT_SERVICE
has top concept: AERONAUTICAL_FEATURE_ACCESS_SERVICE
has top concept: AERONAUTICAL_FEATURE_MANAGEMENT_SERVICE
has top concept: AERONAUTICAL_INFORMATION_SUBSCRIPTION_SERVICE
has top concept: AMDB_FEATURE_ACCESS_SERVICE
has top concept: AMDB_MAP_ACCESS_SERVICE
has top concept: CATALOGUE_SERVICE
has top concept: COVERAGE_ACCESS_SERVICE
has top concept: DATA_PRODUCT_ACCESS_SERVICE
has top concept: FEATURE_ACCESS_SERVICE
has top concept: FLIGHT_FEATURE_ACCESS_AND_MANAGEMENT_SERVICE
has top concept: FLIGHT_FEATURE_ACCESS_SERVICE
has top concept: FLIGHT_FEATURE_MANAGEMENT_SERVICE
has top concept: FLIGHT_INFORMATION_SUBSCRIPTION_SERVICE
has top concept: INFORMATION_SERVICE
has top concept: INFRASTRUCTURE_SERVICE
has top concept: MAP_ACCESS_SERVICE
has top concept: MESSAGE_QUEUE_SERVICE
has top concept: METEOROLOGICAL_FEATURE_ACCESS_AND_MANAGEMENT_SERVICE
has top concept: METEOROLOGICAL_FEATURE_ACCESS_SERVICE
has top concept: METEOROLOGICAL_FEATURE_MANAGEMENT_SERVICE
has top concept: METEOROLOGICAL_INFORMATION_SUBSCRIPTION_SERVICE
has top concept: METEOROLOGICAL_MAP_ACCESS_SERVICE
has top concept: PORTRAYAL_SERVICE
has top concept: PUBLIC_KEY_INFRASTRUCTURE_SERVICE
has top concept: REGISTRY
has top concept: REGISTRY_INFORMATION_SERVICE
has top concept: SUBSCRIPTION_SERVICE

AERONAUTICAL_AERODROME_MAP_ACCESS_SERVICE
type: Concept
alternative label: Aeronautical Aerodrome Map Access Service
definition: A service that provides a client access to aeronautical aerodrome maps.
in scheme: CodeServiceType

AERONAUTICAL_DATA_PRODUCT_ACCESS_SERVICE
type: Concept
alternative label: Aeronautical Data Product Access Service
definition: A service that allows access to and management of an aeronautical data product.
in scheme: CodeServiceType

AERONAUTICAL_FEATURE_ACCESS_AND_MANAGEMENT_SERVICE
type: Concept
alternative label: Aeronautical Feature Access And Management Service
definition: A service that provides a client access to and management of an aeronautical feature store.
in scheme: CodeServiceType

AERONAUTICAL_FEATURE_ACCESS_SERVICE
type: Concept
alternative label: Aeronautical Feature Access Service
definition: A service that provides a client access to an aeronautical feature store.
in scheme: CodeServiceType

AERONAUTICAL_FEATURE_MANAGEMENT_SERVICE
type: Concept
alternative label: Aeronautical Feature Management Service
definition: A service that provides a client management of an aeronautical feature store.
in scheme: CodeServiceType

AERONAUTICAL_INFORMATION_SUBSCRIPTION_SERVICE
type: Concept
alternative label: Aeronautical Information Subscription Service
definition: A service to allow clients to register for notification about aeronautical events.
in scheme: CodeServiceType

AMDB_FEATURE_ACCESS_SERVICE
type: Concept
alternative label: AMDB Feature Access Service
definition: A service that provides a client access to and management of an AMDB feature store.
in scheme: CodeServiceType

AMDB_MAP_ACCESS_SERVICE
type: Concept
alternative label: AMDB Map Access Service
definition: A service that provides a client access to a AMDB maps.
in scheme: CodeServiceType

CATALOGUE_SERVICE
type: Concept
alternative label: Catalogue Service
definition: A service that provides discovery and management capabilities on a store of metadata about resources.
in scheme: CodeServiceType

COVERAGE_ACCESS_SERVICE
type: Concept
alternative label: Coverage Access Service
definition: A service that provides a client access to and management of a coverage store. Coverage is considered as a special case of Feature. An access service may include a query that filters the data returned to the client. NOTE ISO 19123 and ISO 19111 are relevant to coverage access. (source: ISO 19150)
in scheme: CodeServiceType

DATA_PRODUCT_ACCESS_SERVICE
type: Concept
alternative label: Data Product Access Service
definition: A service that allows access to and management of a data product.
in scheme: CodeServiceType

FEATURE_ACCESS_SERVICE
type: Concept
alternative label: Feature Access Service
definition: A service that provides a client access to and management of a feature store. An access service may include a query that filters the data returned to the client. NOTE ISO 19125, ISO 19142 and ISO 19143 are relevant to feature access. (source: ISO 19150)
in scheme: CodeServiceType

FLIGHT_FEATURE_ACCESS_AND_MANAGEMENT_SERVICE
type: Concept
alternative label: Flight Feature Access And Management Service
definition: A service that provides a client access to and management of a flight feature store.
in scheme: CodeServiceType

FLIGHT_FEATURE_ACCESS_SERVICE
type: Concept
alternative label: Flight Feature Access Service
definition: A service that provides a client access to a flight feature store.
in scheme: CodeServiceType

FLIGHT_FEATURE_MANAGEMENT_SERVICE
type: Concept
alternative label: Flight Feature Management Service
definition: A service that provides a client management of a flight feature store.
in scheme: CodeServiceType

FLIGHT_INFORMATION_SUBSCRIPTION_SERVICE
type: Concept
alternative label: Flight Information Subscription Service
definition: A service to allow clients to register for notification about flight events.
in scheme: CodeServiceType

INFORMATION_SERVICE
type: Concept
alternative label: Information Service
definition: A type of service that provides an ATM information sharing capability.
in scheme: CodeServiceType

INFRASTRUCTURE_SERVICE
type: Concept
alternative label: Infrastructure Service
definition: A type of service that provides SWIM infrastructure capabilities such as interface management, request-reply and publish-subscribe messaging, service security, and enterprise service management.
in scheme: CodeServiceType

MAP_ACCESS_SERVICE
type: Concept
alternative label: Map Access Service
definition: A service that provides a client access to a geographic graphics, i.e. pictures of geographic data. NOTE ISO 19128 is relevant to map access. (source: ISO 19150)
in scheme: CodeServiceType

MESSAGE_QUEUE_SERVICE
type: Concept
alternative label: Message Queue Service
definition: A type of service whose main purpose is to publish messages by means of message queues.
in scheme: CodeServiceType

METEOROLOGICAL_COVERAGE_ACCESS_SERVICE
type: Concept
alternative label: Meteorological Coverage Access Service
definition: A service that provides a client access to a meteorological coverage store.
in scheme: CodeServiceType

METEOROLOGICAL_FEATURE_ACCESS_AND_MANAGEMENT_SERVICE
type: Concept
alternative label: Meteorological Feature Access And Management Service
definition: A service that provides a client access to and management of an meteorological feature store.
in scheme: CodeServiceType

METEOROLOGICAL_FEATURE_ACCESS_SERVICE
type: Concept
alternative label: Meteorological Feature Access Service
definition: A service that provides a client access to an meteorological feature store.
in scheme: CodeServiceType

METEOROLOGICAL_FEATURE_MANAGEMENT_SERVICE
type: Concept
alternative label: Meteorological Feature Management Service
definition: A service that provides a client management of an meteorological feature store.
in scheme: CodeServiceType

METEOROLOGICAL_INFORMATION_SUBSCRIPTION_SERVICE
type: Concept
alternative label: Meteorological Information Subscription Service
definition: A service to allow clients to register for notification about meteorological phenomena.
in scheme: CodeServiceType

METEOROLOGICAL_MAP_ACCESS_SERVICE
type: Concept
alternative label: Meteorological Map Access Service
definition: A service that provides a client access to a aviation meteorological maps.
in scheme: CodeServiceType

PORTRAYAL_SERVICE
type: Concept
alternative label: Portrayal Service
definition: A service that provides or creates a portrayal.
in scheme: CodeServiceType

PUBLIC_KEY_INFRASTRUCTURE_SERVICE
type: Concept
alternative label: Public Key Infrastructure Service
definition: A service that enables issuance and management of the digital certificates to ensure confidentiality, integrity and non-repudiation of the data moving across systems.
in scheme: CodeServiceType

REGISTRY
type: Concept
alternative label: Registry
definition: A service that provides a discovery and management capabilities on a store of metadata about services.
in scheme: CodeServiceType

REGISTRY_INFORMATION_SERVICE
type: Concept
alternative label: Registry Information Service
definition: A type of service that provides a service metadata sharing capability.
in scheme: CodeServiceType

SUBSCRIPTION_SERVICE
type: Concept
alternative label: Subscription Service
definition: A service to allow clients to register for notification about events. Events are defined by a service that performs an activity resulting in the event. Events are catalogued by the subscription service. Clients identify events of interest, e.g. receipt of data with a specific geographic extent. When an event occurs, the subscription service sends notification to all clients who have registered an interest in the event. Once an event occurs, a subscription service may cause an activity to occur, e.g. delivery of a product. (source: ISO 19150)
in scheme: CodeServiceType

CodeServiceValidationType
type: ConceptScheme
alternative label: Code service validation type
definition: Activities whereby a service is checked for conformance with the service objectives and requirements.
has top concept: COLLABORATIVE_VALIDATION
has top concept: INDEPENDENT_VALIDATION
has top concept: NOT_VALIDATED
has top concept: SELF_VALIDATION
has top concept: USER_VALIDATION

COLLABORATIVE_VALIDATION
type: Concept
alternative label: Collaborative Validation
definition: A validation of service jointly carried out by the service provider together with service users.
in scheme: CodeServiceValidationType

INDEPENDENT_VALIDATION
type: Concept
alternative label: Independent Validation
definition: A validation of service carried out by an independent authority.
in scheme: CodeServiceValidationType

NOT_VALIDATED
type: Concept
alternative label: Not Validated
definition: A statement that no validation of service has taken place.
in scheme: CodeServiceValidationType

SELF_VALIDATION
type: Concept
alternative label: Self Validation
definition: A validation of service carried out by the service provider.
in scheme: CodeServiceValidationType

USER_VALIDATION
type: Concept
alternative label: User Validation
definition: A validation of service carried out by service users.
in scheme: CodeServiceValidationType

CodeStakeholderType
type: ConceptScheme
alternative label: Stakeholder Type Code
definition: A categorisation of services based on the type of stakeholder.
has top concept: AERONAUTICAL_INFORMATION_SERVICE_PROVIDER
has top concept: AIRPORT_OPERATOR
has top concept: AIRSIDE_GROUND_HANDLER
has top concept: AIR_TRAFFIC_SERVICE_PROVIDER
has top concept: CIVIL_AIRSPACE_USER
has top concept: CIVIL_AIR_NAVIGATION_SERVICE_PROVIDER
has top concept: COMMUNICATION_NAVIGATION_AND_SURVEILLANCE_SERVICE_PROVIDER
has top concept: MILITARY_AIRSPACE_USER
has top concept: MILITARY_AIR_NAVIGATION_SERVICE_PROVIDER
has top concept: MILITARY_DEFENCE_CENTRE
has top concept: NETWORK_MANAGER
has top concept: OVERSIGHT AUTHORITY
has top concept: PROVIDER_OF_DATA_SERVICES
has top concept: REGULATED_METEOROLOGICAL_SERVICE_PROVIDER

AERONAUTICAL_INFORMATION_SERVICE_PROVIDER
type: Concept
alternative label: Aeronautical Information Service Provider
definition: A service established within the defined area of coverage responsible for the provision of aeronautical information/data necessary for the safety, regularity and efficiency of air navigation.
in scheme: CodeStakeholderType

AIRPORT_OPERATOR
type: Concept
alternative label: Aiport Operator
definition: The civilian or military agency, group or individual which exercises control over the operations of the civil airport or military airfield.
in scheme: CodeStakeholderType

AIRSIDE_GROUND_HANDLER
type: Concept
alternative label: Airside Ground Handler
definition: A stakeholder involved in the services necessary for an aircraft's arrival at, and departure from, an airport, other than air traffic services.
in scheme: CodeStakeholderType

AIR_TRAFFIC_SERVICE_PROVIDER
type: Concept
alternative label: Air Traffic Service Provider
definition: A generic term meaning variously, flight information service, alerting service, air traffic advisory service, air traffic control service (area control service, approach control service or aerodrome control service).
in scheme: CodeStakeholderType

CIVIL_AIRSPACE_USER
type: Concept
alternative label: Civil Airspace User
definition: A generic term designating an organization operating aircraft and its pilots, the flight operations centres (FOC) responsible for the strategic planning of a flight and the entity responsible for the execution of a flight which is traditionally a flight deck.
in scheme: CodeStakeholderType

CIVIL_AIR_NAVIGATION_SERVICE_PROVIDER
type: Concept
alternative label: Civil Air Navigation Service Provider
definition: Any public or private entity providing air navigation services for general air traffic.
in scheme: CodeStakeholderType

COMMUNICATION_NAVIGATION_AND_SURVEILLANCE_SERVICE_PROVIDER
type: Concept
alternative label: Communication Navigation and Surveillance Service Provider
definition: A provider of CNS services.
in scheme: CodeStakeholderType

MILITARY_AIRSPACE_USER
type: Concept
alternative label: Military Airspace User
definition: Airspace User under the authority of a military organisation.
in scheme: CodeStakeholderType

MILITARY_AIR_NAVIGATION_SERVICE_PROVIDER
type: Concept
alternative label: Military Air Navigation Service Provider
definition: Any public or private entity providing air navigation services for military air traffic.
in scheme: CodeStakeholderType

MILITARY_DEFENCE_CENTRE
type: Concept
alternative label: Military Defence Centre
definition: A military defence centre.
in scheme: CodeStakeholderType

NETWORK_MANAGER
type: Concept
alternative label: Network Manager
definition: The organization responsible for enabling the optimum use of airspace and ensure that Airspace Users can operate preferred trajectories while allowing maximum access to airspaces and air navigation services.
in scheme: CodeStakeholderType

OVERSIGHT AUTHORITY
type: Concept
alternative label: Oversight Authority
definition: Any entity responsible for monitoring, regulating, and ensuring compliance with laws, policies and standards within a particular field or organisation.
in scheme: CodeStakeholderType

PROVIDER_OF_DATA_SERVICES
type: Concept
alternative label: Provider of Data Services
definition: A public or private entity responsible for the management of a Data Service Provision to one or several Virtual Centre.
in scheme: CodeStakeholderType

REGULATED_METEOROLOGICAL_SERVICE_PROVIDER
type: Concept
alternative label: Regulated Meteorological Service Provider
definition: An office designated to provide meteorological service for international air navigation.
in scheme: CodeStakeholderType

CodeTIYPServiceInterfaceBindingType
type: ConceptScheme
alternative label: Code TIYPService interface binding type
definition: Interface bindings listed in the EUROCONTROL Specification for SWIM Technical Infrastructure Yellow Profile that enable services to exchange data with consuming applications.
has top concept: SWIM_TI_YP_1_0_AMQP_MESSAGING
has top concept: SWIM_TI_YP_1_0_WS-N_SOAP
has top concept: SWIM_TI_YP_1_0_WS-N_SOAP_WITH_BASIC_MESSAGE_SECURITY
has top concept: SWIM_TI_YP_1_0_WS-N_SOAP_WITH_FEDERATED_SECURITY
has top concept: SWIM_TI_YP_1_0_WS-N_SOAP_WITH_MESSAGE_SECURITY
has top concept: SWIM_TI_YP_1_0_WS_LIGHT
has top concept: SWIM_TI_YP_1_0_WS_SOAP
has top concept: SWIM_TI_YP_1_0_WS_SOAP_WITH_BASIC_MESSAGE_SECURITY
has top concept: SWIM_TI_YP_1_0_WS_SOAP_WITH_FEDERATED_SECURITY
has top concept: SWIM_TI_YP_1_0_WS_SOAP_WITH_MESSAGE_SECURITY
has top concept: SWIM_TI_YP_1_1_AMQP_MESSAGING
has top concept: SWIM_TI_YP_1_1_WS-N_SOAP
has top concept: SWIM_TI_YP_1_1_WS-N_SOAP_WITH_BASIC_MESSAGE_SECURITY
has top concept: SWIM_TI_YP_1_1_WS-N_SOAP_WITH_FEDERATED_SECURITY
has top concept: SWIM_TI_YP_1_1_WS-N_SOAP_WITH_MESSAGE_SECURITY
has top concept: SWIM_TI_YP_1_1_WS_LIGHT
has top concept: SWIM_TI_YP_1_1_WS_SOAP
has top concept: SWIM_TI_YP_1_1_WS_SOAP_WITH_BASIC_MESSAGE_SECURITY
has top concept: SWIM_TI_YP_1_1_WS_SOAP_WITH_FEDERATED_SECURITY
has top concept: SWIM_TI_YP_1_1_WS_SOAP_WITH_MESSAGE_SECURITY

SWIM_TI_YP_1_0_AMQP_MESSAGING
type: Concept
alternative label: SWIM TIYP 1.0 AMQP MESSAGING
definition: The AMQP_MESSAGING Interface Binding as detailed in the EUROCONTROL Specification for SWIM Technical Infrastructure Yellow Profile, edition1.0.
in scheme: CodeTIYPServiceInterfaceBindingType

SWIM_TI_YP_1_0_WS-N_SOAP
type: Concept
alternative label: SWIM TIYP 1.0 WS-N SOAP
definition: The WS-N SOAP Interface Binding as detailed in the EUROCONTROL Specification for SWIM Technical Infrastructure Yellow Profile, edition1.0.
in scheme: CodeTIYPServiceInterfaceBindingType

SWIM_TI_YP_1_0_WS-N_SOAP_WITH_BASIC_MESSAGE_SECURITY
type: Concept
alternative label: SWIM TIYP 1.0 WS-N SOAP WITH BASIC MESSAGE SECURITY
definition: The WS-N SOAP with Basic Message Security Interface Binding as detailed in the EUROCONTROL Specification for SWIM Technical Infrastructure Yellow Profile, edition1.0.
in scheme: CodeTIYPServiceInterfaceBindingType

SWIM_TI_YP_1_0_WS-N_SOAP_WITH_FEDERATED_SECURITY
type: Concept
alternative label: SWIM TIYP 1.0 WS-N SOAP WITH FEDERATED SECURITY
definition: The WS-N SOAP with Federated Security Interface Binding as detailed in the EUROCONTROL Specification for SWIM Technical Infrastructure Yellow Profile, edition1.0.
in scheme: CodeTIYPServiceInterfaceBindingType

SWIM_TI_YP_1_0_WS-N_SOAP_WITH_MESSAGE_SECURITY
type: Concept
alternative label: SWIM TIYP 1.0 WS-N SOAP WITH MESSAGE SECURITY
definition: The WS-N SOAP with Message Security Interface Binding as detailed in the EUROCONTROL Specification for SWIM Technical Infrastructure Yellow Profile, edition1.0.
in scheme: CodeTIYPServiceInterfaceBindingType

SWIM_TI_YP_1_0_WS_LIGHT
type: Concept
alternative label: SWIM TIYP 1.0 WS LIGHT
definition: The WS Light Interface Binding as detailed in the EUROCONTROL Specification for SWIM Technical Infrastructure Yellow Profile, edition1.0.
in scheme: CodeTIYPServiceInterfaceBindingType

SWIM_TI_YP_1_0_WS_SOAP
type: Concept
alternative label: SWIM TIYP 1.0 WS SOAP
definition: The WS SOAP Interface Binding as detailed in the EUROCONTROL Specification for SWIM Technical Infrastructure Yellow Profile, edition1.0.
in scheme: CodeTIYPServiceInterfaceBindingType

SWIM_TI_YP_1_0_WS_SOAP_WITH_BASIC_MESSAGE_SECURITY
type: Concept
alternative label: SWIM TIYP 1.0 WS SOAP WITH BASIC MESSAGE SECURITY
definition: The WS SOAP with Basic Message Security Interface Binding as detailed in the EUROCONTROL Specification for SWIM Technical Infrastructure Yellow Profile, edition1.0.
in scheme: CodeTIYPServiceInterfaceBindingType

SWIM_TI_YP_1_0_WS_SOAP_WITH_FEDERATED_SECURITY
type: Concept
alternative label: SWIM TIYP 1.0 WS SOAP WITH FEDERATED SECURITY
definition: The WS SOAP with Federated Security Interface Binding as detailed in the EUROCONTROL Specification for SWIM Technical Infrastructure Yellow Profile, edition1.0.
in scheme: CodeTIYPServiceInterfaceBindingType

SWIM_TI_YP_1_0_WS_SOAP_WITH_MESSAGE_SECURITY
type: Concept
alternative label: SWIM TIYP 1.0 WS SOAP WITH MESSAGE SECURITY
definition: The WS SOAP with Message Security Interface Binding as detailed in the EUROCONTROL Specification for SWIM Technical Infrastructure Yellow Profile, edition1.0.
in scheme: CodeTIYPServiceInterfaceBindingType

SWIM_TI_YP_1_1_AMQP_MESSAGING
type: Concept
alternative label: SWIM TIYP 1.1 AMQP MESSAGING
definition: The AMQP_MESSAGING Interface Binding as detailed in the EUROCONTROL Specification for SWIM Technical Infrastructure Yellow Profile, edition1.1.
in scheme: CodeTIYPServiceInterfaceBindingType

SWIM_TI_YP_1_1_WS-N_SOAP
type: Concept
alternative label: SWIM TIYP 1.1 WS-N SOAP
definition: The WS-N SOAP Interface Binding as detailed in the EUROCONTROL Specification for SWIM Technical Infrastructure Yellow Profile, edition1.1.
in scheme: CodeTIYPServiceInterfaceBindingType

SWIM_TI_YP_1_1_WS-N_SOAP_WITH_BASIC_MESSAGE_SECURITY
type: Concept
alternative label: SWIM TIYP 1.1 WS-N SOAP WITH BASIC MESSAGE SECURITY
definition: The WS-N SOAP with Basic Message Security Interface Binding as detailed in the EUROCONTROL Specification for SWIM Technical Infrastructure Yellow Profile, edition1.1.
in scheme: CodeTIYPServiceInterfaceBindingType

SWIM_TI_YP_1_1_WS-N_SOAP_WITH_FEDERATED_SECURITY
type: Concept
alternative label: SWIM TIYP 1.1 WS-N SOAP WITH FEDERATED SECURITY
definition: The WS SOAP with Federated Security Interface Binding as detailed in the EUROCONTROL Specification for SWIM Technical Infrastructure Yellow Profile, edition1.1.
in scheme: CodeTIYPServiceInterfaceBindingType

SWIM_TI_YP_1_1_WS-N_SOAP_WITH_MESSAGE_SECURITY
type: Concept
alternative label: SWIM TIYP 1.1 WS-N SOAP WITH MESSAGE SECURITY
definition: The WS-N SOAP with Message Security Interface Binding as detailed in the EUROCONTROL Specification for SWIM Technical Infrastructure Yellow Profile, edition1.1.
in scheme: CodeTIYPServiceInterfaceBindingType

SWIM_TI_YP_1_1_WS_LIGHT
type: Concept
alternative label: SWIM TIYP 1.1 WS LIGHT
definition: The WS Light Interface Binding as detailed in the EUROCONTROL Specification for SWIM Technical Infrastructure Yellow Profile, edition1.1.
in scheme: CodeTIYPServiceInterfaceBindingType

SWIM_TI_YP_1_1_WS_SOAP
type: Concept
alternative label: SWIM TIYP 1.1 WS SOAP
definition: The WS SOAP Interface Binding as detailed in the EUROCONTROL Specification for SWIM Technical Infrastructure Yellow Profile, edition1.1.
in scheme: CodeTIYPServiceInterfaceBindingType

SWIM_TI_YP_1_1_WS_SOAP_WITH_BASIC_MESSAGE_SECURITY
type: Concept
alternative label: SWIM TIYP 1.1 WS SOAP WITH BASIC MESSAGE SECURITY
definition: The WS SOAP with Basic Message Security Interface Binding as detailed in the EUROCONTROL Specification for SWIM Technical Infrastructure Yellow Profile, edition1.1.
in scheme: CodeTIYPServiceInterfaceBindingType

SWIM_TI_YP_1_1_WS_SOAP_WITH_FEDERATED_SECURITY
type: Concept
alternative label: SWIM TIYP 1.1 WS SOAP WITH FEDERATED SECURITY
definition: The WS SOAP with Federated Security Interface Binding as detailed in the EUROCONTROL Specification for SWIM Technical Infrastructure Yellow Profile, edition1.1.
in scheme: CodeTIYPServiceInterfaceBindingType

SWIM_TI_YP_1_1_WS_SOAP_WITH_MESSAGE_SECURITY
type: Concept
alternative label: SWIM TIYP 1.1 WS SOAP WITH MESSAGE SECURITY
definition: The WS SOAP with Message Security Interface Binding as detailed in the EUROCONTROL Specification for SWIM Technical Infrastructure Yellow Profile, edition1.1.
in scheme: CodeTIYPServiceInterfaceBindingType

SWIM Reference Service Categories
type: Ontology
created: 2021-03-22
creator: EUROCONTROL
description: This ontology contains all the SKOS Concept Schemes that are used for SWIM Service Categories.
modified: 2025-02-04
publisher: EUROCONTROL
source: service-categories.html
imports: terms
imports: core
version info: 0.6